{"text_format":"1","workbook":"xlsx","n_sheets":14,"sheets":["Table Pythagore","Table ","Table ordre","Table désordre","Table --> 5","Table --> 10","Pythagores (ordre)","Pythagores (25) -->choisir","Pythagores (25) -->toutes","Pythagores (49)","Pythagores (100)","calculs","Graphique tables CE","Graphique tables CM"],"not_rendered":{"charts":0,"images":0,"macros":1,"external_links":0,"defined_names":14,"comments":0,"pivot_tables":0},"unopened":[],"bounds":{"document_bytes":16777216,"sheet_cells":100000,"rows_first":2000,"rows_last":500,"rows_between":2000,"halvings":0,"cell_chars":16384,"cell_head_chars":4096},"cells_cut":0,"cells_raw":0,"read":"whole","date_system":"1900"}

{"sheet":"Table Pythagore","index":0,"n_rows":11,"n_cols":11,"rows_kept":11,"cut":false,"hidden":false,"merged":[]}
["x",1,2,3,4,5,6,7,8,9,10]
[1,{"$f":"B$1*$A2","v":1},2,3,4,5,6,7,8,9,10]
[2,{"$f":"B$1*$A3","v":2},4,6,8,10,12,14,16,18,20]
[3,3,6,9,12,15,18,21,24,27,30]
[4,4,8,12,16,20,24,28,32,36,40]
[5,5,10,15,20,25,30,35,40,45,50]
[6,6,12,18,24,30,36,42,48,54,60]
[7,7,14,21,28,35,42,49,56,63,70]
[8,8,16,24,32,40,48,56,64,72,80]
[9,9,18,27,36,45,54,63,72,81,90]
{"$rows_left_out":2}
{"sheet":"Table ","index":1,"n_rows":12,"n_cols":5,"rows_kept":12,"cut":false,"hidden":false,"merged":[[0,0,0,3]]}
["Table de ",null,null,null,10]
[]
[1,"x",{"$f":"$E$1","v":10},"=",{"$f":"A3*C3","v":10}]
[2,"x",10,"=",{"$f":"A4*C4","v":20}]
[3,"x",10,"=",30]
[4,"x",10,"=",40]
[5,"x",10,"=",50]
[6,"x",10,"=",60]
[7,"x",10,"=",70]
[8,"x",10,"=",80]
{"$rows_left_out":3}
{"sheet":"Table ordre","index":2,"n_rows":39,"n_cols":14,"rows_kept":39,"cut":false,"hidden":false,"merged":[[0,0,0,9],[0,10,0,14]]}
["Générer table de",null,null,null,null,null,null,null,null,null,2]
[null,null,"Table de ",{"$f":"K1","v":2},null,null,null,"Table de ",{"$f":"$D$2","v":2},null,null,null,"Table de ",{"$f":"$D$2","v":2}]
[]
[1,"x",{"$f":"$D$2","v":2},"=",null,1,"x",{"$f":"$D$2","v":2},"=",null,1,"x",{"$f":"$D$2","v":2},"="]
[2,"x",{"$f":"$D$2","v":2},"=",null,2,"x",{"$f":"$D$2","v":2},"=",null,2,"x",{"$f":"$D$2","v":2},"="]
[3,"x",2,"=",null,3,"x",2,"=",null,3,"x",2,"="]
[4,"x",2,"=",null,4,"x",2,"=",null,4,"x",2,"="]
[5,"x",2,"=",null,5,"x",2,"=",null,5,"x",2,"="]
[6,"x",2,"=",null,6,"x",2,"=",null,6,"x",2,"="]
[7,"x",2,"=",null,7,"x",2,"=",null,7,"x",2,"="]
{"$rows_left_out":30}
{"sheet":"Table désordre","index":3,"n_rows":39,"n_cols":15,"rows_kept":39,"cut":false,"hidden":false,"merged":[[0,1,0,10],[0,11,0,15]]}
[null,"Générer table de",null,null,null,null,null,null,null,null,null,10]
[null,null,null,"Table de ",{"$f":"L1","v":10},null,null,null,"Table de ",{"$f":"$E$2","v":10},null,null,null,"Table de ",{"$f":"$E$2","v":10}]
[]
[1,{"$f":"calculs!B3","v":2},"x",{"$f":"$E$2","v":10},"=",null,{"$f":"HLOOKUP(A4,calculs!$B$4:$K$6,3)","v":4},"x",{"$f":"$E$2","v":10},"=",null,{"$f":"HLOOKUP(A4,calculs!$B$7:$K$9,3)","v":8},"x",{"$f":"$E$2","v":10},"="]
[2,{"$f":"calculs!C3","v":5},"x",10,"=",null,{"$f":"HLOOKUP(A5,calculs!$B$4:$K$6,3)","v":8},"x",10,"=",null,{"$f":"HLOOKUP(A5,calculs!$B$7:$K$9,3)","v":6},"x",10,"="]
[3,{"$f":"calculs!D3","v":10},"x",10,"=",null,{"$f":"HLOOKUP(A6,calculs!$B$4:$K$6,3)","v":5},"x",10,"=",null,{"$f":"HLOOKUP(A6,calculs!$B$7:$K$9,3)","v":4},"x",10,"="]
[4,{"$f":"calculs!E3","v":7},"x",10,"=",null,{"$f":"HLOOKUP(A7,calculs!$B$4:$K$6,3)","v":10},"x",10,"=",null,{"$f":"HLOOKUP(A7,calculs!$B$7:$K$9,3)","v":9},"x",10,"="]
[5,{"$f":"calculs!F3","v":8},"x",10,"=",null,{"$f":"HLOOKUP(A8,calculs!$B$4:$K$6,3)","v":7},"x",10,"=",null,{"$f":"HLOOKUP(A8,calculs!$B$7:$K$9,3)","v":10},"x",10,"="]
[6,{"$f":"calculs!G3","v":6},"x",10,"=",null,{"$f":"HLOOKUP(A9,calculs!$B$4:$K$6,3)","v":1},"x",10,"=",null,{"$f":"HLOOKUP(A9,calculs!$B$7:$K$9,3)","v":5},"x",10,"="]
[7,{"$f":"calculs!H3","v":9},"x",10,"=",null,{"$f":"HLOOKUP(A10,calculs!$B$4:$K$6,3)","v":3},"x",10,"=",null,{"$f":"HLOOKUP(A10,calculs!$B$7:$K$9,3)","v":7},"x",10,"="]
{"$rows_left_out":30}
{"sheet":"Table --> 5","index":4,"n_rows":40,"n_cols":30,"rows_kept":40,"cut":false,"hidden":true,"merged":[[27,0,27,4],[27,5,27,9],[27,10,27,14],[1,0,1,4],[1,5,1,9],[1,10,1,14],[14,10,14,14],[14,5,14,9],[14,0,14,4],[27,15,27,19],[27,20,27,24],[27,25,27,29],[1,15,1,19],[1,20,1,24],[1,25,1,29],[14,15,14,19],[14,20,14,24],[14,25,14,29]]}
[]
["Tables *    ",null,null,null,null,"Tables *",null,null,null,null,"Tables *",null,null,null,null,"Tables *    ",null,null,null,null,"Tables *",null,null,null,null,"Tables *"]
[]
[{"$f":"calculs!B109","v":1},"x",{"$f":"calculs!#REF!","v":{"$error":"#REF!"}},"=",null,{"$f":"calculs!P107","v":8},"x",{"$f":"calculs!K77","v":4},"=",null,{"$f":"calculs!S107","v":4},"x",{"$f":"calculs!N77","v":4},"=",null,{"$f":"A4","v":1},"x",{"$f":"C4","v":{"$error":"#REF!"}},"=",{"$f":"P4*R4","v":{"$error":"#REF!"}},{"$f":"F4","v":8},"x",{"$f":"H4","v":4},"=",{"$f":"U4*W4","v":32},{"$f":"K4","v":4},"x",{"$f":"M4","v":4},"=",{"$f":"Z4*AB4","v":16}]
[{"$f":"calculs!C109","v":3},"x",{"$f":"calculs!#REF!","v":{"$error":"#REF!"}},"=",null,{"$f":"calculs!P108","v":5},"x",{"$f":"calculs!K78","v":""},"=",null,{"$f":"calculs!S108","v":10},"x",{"$f":"calculs!N78","v":""},"=",null,{"$f":"A5","v":3},"x",{"$f":"C5","v":{"$error":"#REF!"}},"=",{"$f":"P5*R5","v":{"$error":"#REF!"}},{"$f":"F5","v":5},"x",{"$f":"H5","v":""},"=",{"$f":"U5*W5","v":{"$error":"#VALUE!"}},{"$f":"K5","v":10},"x",{"$f":"M5","v":""},"=",{"$f":"Z5*AB5","v":{"$error":"#VALUE!"}}]
[{"$f":"calculs!D109","v":8},"x",{"$f":"calculs!#REF!","v":{"$error":"#REF!"}},"=",null,{"$f":"calculs!P109","v":9},"x",{"$f":"calculs!K79","v":""},"=",null,{"$f":"calculs!S109","v":6},"x",{"$f":"calculs!N79","v":""},"=",null,8,"x",{"$error":"#REF!"},"=",{"$error":"#REF!"},9,"x","","=",{"$error":"#VALUE!"},6,"x","","=",{"$error":"#VALUE!"}]
[{"$f":"calculs!E109","v":10},"x",{"$f":"calculs!#REF!","v":{"$error":"#REF!"}},"=",null,{"$f":"calculs!P110","v":2},"x",{"$f":"calculs!K80","v":""},"=",null,{"$f":"calculs!S110","v":2},"x",{"$f":"calculs!N80","v":""},"=",null,10,"x",{"$error":"#REF!"},"=",{"$error":"#REF!"},2,"x","","=",{"$error":"#VALUE!"},2,"x","","=",{"$error":"#VALUE!"}]
[{"$f":"calculs!F109","v":5},"x",{"$f":"calculs!#REF!","v":{"$error":"#REF!"}},"=",null,{"$f":"calculs!P111","v":10},"x",{"$f":"calculs!K81","v":""},"=",null,{"$f":"calculs!S111","v":5},"x",{"$f":"calculs!N81","v":""},"=",null,5,"x",{"$error":"#REF!"},"=",{"$error":"#REF!"},10,"x","","=",{"$error":"#VALUE!"},5,"x","","=",{"$error":"#VALUE!"}]
[{"$f":"calculs!G109","v":9},"x",{"$f":"calculs!B76","v":9},"=",null,{"$f":"calculs!P112","v":1},"x",{"$f":"calculs!N77","v":4},"=",null,{"$f":"calculs!S112","v":7},"x",{"$f":"calculs!Q77","v":4},"=",null,9,"x",9,"=",81,1,"x",4,"=",4,7,"x",4,"=",28]
[{"$f":"calculs!H109","v":7},"x",{"$f":"calculs!C76","v":6},"=",null,{"$f":"calculs!P113","v":3},"x",{"$f":"calculs!N78","v":""},"=",null,{"$f":"calculs!S113","v":9},"x",{"$f":"calculs!Q78","v":""},"=",null,7,"x",6,"=",42,3,"x","","=",{"$error":"#VALUE!"},9,"x","","=",{"$error":"#VALUE!"}]
{"$rows_left_out":31}
{"sheet":"Table --> 10","index":5,"n_rows":40,"n_cols":15,"rows_kept":40,"cut":false,"hidden":false,"merged":[[27,0,27,4],[27,5,27,9],[27,10,27,14],[1,0,1,4],[1,5,1,9],[1,10,1,14],[14,10,14,14],[14,5,14,9],[14,0,14,4]]}
[]
["Tables ***",null,null,null,null,"Tables ***",null,null,null,null,"Tables ***"]
[]
[{"$f":"calculs!C39","v":3},"*",{"$f":"calculs!B42","v":9},"=",null,3,"x",7,"=",null,6,"x",4,"="]
[{"$f":"calculs!D39","v":10},"x",{"$f":"calculs!C42","v":5},"=",null,7,"x",8,"=",null,7,"x",8,"="]
[{"$f":"calculs!E39","v":4},"x",{"$f":"calculs!D42","v":6},"=",null,4,"x",6,"=",null,8,"x",9,"="]
[{"$f":"calculs!F39","v":5},"x",{"$f":"calculs!E42","v":7},"=",null,6,"x",9,"=",null,4,"x",6,"="]
[{"$f":"calculs!G39","v":8},"x",{"$f":"calculs!F42","v":3},"=",null,8,"x",3,"=",null,4,"x",9,"="]
[{"$f":"calculs!H39","v":2},"x",{"$f":"calculs!G42","v":1},"=",null,9,"x",8,"=",null,5,"x",6,"="]
[{"$f":"calculs!I39","v":9},"x",{"$f":"calculs!H42","v":10},"=",null,3,"x",4,"=",null,7,"x",7,"="]
{"$rows_left_out":31}
{"sheet":"Pythagores (ordre)","index":6,"n_rows":43,"n_cols":26,"rows_kept":43,"cut":false,"hidden":false,"merged":[[13,0,13,5],[28,0,28,5],[42,0,42,5]]}
[]
[]
[null,"x",1,2,3,4,5,6,7,8,9,10,null,null,null,"x",1,2,3,4,5,6,7,8,9,10]
[null,1,null,null,null,null,null,null,null,null,null,null,null,null,null,1]
[null,2,null,null,null,null,null,null,null,null,null,null,null,null,null,2]
[null,3,null,null,null,null,null,null,null,null,null,null,null,null,null,3]
[null,4,null,null,null,null,null,null,null,null,null,null,null,null,null,4]
[null,5,null,null,null,null,null,null,null,null,null,null,null,null,null,5]
[null,6,null,null,null,null,null,null,null,null,null,null,null,null,null,6]
[null,7,null,null,null,null,null,null,null,null,null,null,null,null,null,7]
{"$rows_left_out":34}
{"sheet":"Pythagores (25) -->choisir","index":7,"n_rows":30,"n_cols":19,"rows_kept":30,"cut":false,"hidden":false,"merged":[[29,1,29,9],[1,9,1,10],[1,11,1,12],[2,11,2,12],[2,9,2,10],[4,3,4,7],[4,13,4,17],[13,3,13,7],[13,13,13,17],[22,3,22,7],[22,13,22,17],[20,1,20,9]]}
[null,null,null,null,"Pour générer de nouvelles tables, appuyez sur F9"]
[null,null,null,1,2,3,4,5,null,6,null,7,null,8,9,10]
[null,null,null,null,null,null,"ok","ok",null,"ok",null,"ok",null,"ok","ok"]
[]
[null,null,null,"25 cases (facile) --> 3 minutes maxi",null,null,null,null,null,null,null,null,null,"25 cases (facile) --> 3 minutes maxi"]
[null,null,"x",{"$f":"calculs!B109","v":1},{"$f":"calculs!C109","v":3},{"$f":"calculs!D109","v":8},{"$f":"calculs!E109","v":10},{"$f":"calculs!F109","v":5},"x",null,null,null,"x",{"$f":"HLOOKUP(calculs!B4,calculs!B4:K6,3,TRUE)","v":4},{"$f":"HLOOKUP(calculs!C4,calculs!B4:K6,3,TRUE)","v":8},{"$f":"HLOOKUP(calculs!D4,calculs!B4:K6,3,TRUE)","v":5},{"$f":"HLOOKUP(calculs!E4,calculs!B4:K6,3,TRUE)","v":10},{"$f":"HLOOKUP(calculs!F4,calculs!B4:K6,3,TRUE)","v":7},"x"]
[null,null,{"$f":"calculs!B$73","v":3},null,null,null,null,null,{"$f":"C7","v":3},null,null,null,{"$f":"calculs!B76","v":9},null,null,null,null,null,{"$f":"M7","v":9}]
[null,null,{"$f":"calculs!C$73","v":1},null,null,null,null,null,{"$f":"C8","v":1},null,null,null,{"$f":"calculs!C76","v":6},null,null,null,null,null,{"$f":"M8","v":6}]
[null,null,{"$f":"calculs!D$73","v":5},null,null,null,null,null,5,null,null,null,{"$f":"calculs!D76","v":4},null,null,null,null,null,4]
[null,null,{"$f":"calculs!E$73","v":2},null,null,null,null,null,2,null,null,null,{"$f":"calculs!E76","v":5},null,null,null,null,null,5]
{"$rows_left_out":21}
{"sheet":"Pythagores (25) -->toutes","index":8,"n_rows":28,"n_cols":19,"rows_kept":28,"cut":false,"hidden":false,"merged":[[27,1,27,9],[2,3,2,7],[2,13,2,17],[11,3,11,7],[11,13,11,17],[20,3,20,7],[20,13,20,17],[18,1,18,9]]}
[null,null,null,null,"Pour générer de nouvelles tables, appuyez sur F9"]
[]
[null,null,null,"25 cases (difficile) --> 3 minutes maxi",null,null,null,null,null,null,null,null,null,"25 cases (difficile) --> 3 minutes maxi"]
[null,null,"x",{"$f":"calculs!C42","v":5},{"$f":"calculs!D42","v":6},{"$f":"calculs!E39","v":4},{"$f":"calculs!F42","v":3},{"$f":"calculs!G42","v":1},"x",null,null,null,"x",{"$f":"HLOOKUP(calculs!B1,calculs!$B$1:$K$3,3,TRUE)","v":2},{"$f":"HLOOKUP(calculs!C1,calculs!$B$1:$K$3,3,TRUE)","v":5},{"$f":"HLOOKUP(calculs!D1,calculs!$B$1:$K$3,3,TRUE)","v":10},{"$f":"HLOOKUP(calculs!E1,calculs!$B$1:$K$3,3,TRUE)","v":7},{"$f":"HLOOKUP(calculs!F1,calculs!$B$1:$K$3,3,TRUE)","v":8},"x"]
[null,null,{"$f":"calculs!C39","v":3},null,null,null,null,null,{"$f":"C5","v":3},null,null,null,{"$f":"HLOOKUP(calculs!B4,calculs!B4:K6,3,TRUE)","v":4},null,null,null,null,null,{"$f":"M5","v":4}]
[null,null,{"$f":"calculs!D39","v":10},null,null,null,null,null,{"$f":"C6","v":10},null,null,null,{"$f":"HLOOKUP(calculs!C4,calculs!B4:K6,3,TRUE)","v":8},null,null,null,null,null,{"$f":"M6","v":8}]
[null,null,{"$f":"calculs!E39","v":4},null,null,null,null,null,4,null,null,null,{"$f":"HLOOKUP(calculs!D4,calculs!B4:K6,3,TRUE)","v":5},null,null,null,null,null,5]
[null,null,{"$f":"calculs!F39","v":5},null,null,null,null,null,5,null,null,null,{"$f":"HLOOKUP(calculs!E4,calculs!B4:K6,3,TRUE)","v":10},null,null,null,null,null,10]
[null,null,{"$f":"calculs!G39","v":8},null,null,null,null,null,8,null,null,null,{"$f":"HLOOKUP(calculs!F4,calculs!B4:K6,3,TRUE)","v":7},null,null,null,null,null,7]
[null,null,null,null,null,"Temps:      min.       sec.",null,null,null,null,null,null,null,null,null,"Temps:      min.       sec."]
{"$rows_left_out":19}
{"sheet":"Pythagores (49)","index":9,"n_rows":36,"n_cols":23,"rows_kept":36,"cut":false,"hidden":false,"merged":[[26,3,26,9],[26,15,26,21],[0,1,0,23],[4,3,4,9],[4,15,4,21],[15,3,15,9],[15,15,15,21]]}
[null,"Enlever les tables de:"]
[null,1,"oui",2,"oui",3,"non",4,"oui",5,null,"oui",6,"oui",7,"oui",8,"oui",9,"oui",10,"non"]
[null,null,null,null,"Pour générer de nouvelles tables, appuyez sur F9"]
[]
[null,null,null,"49 cases (5 minutes maxi)",null,null,null,null,null,null,null,null,null,null,null,"49 cases (5 minutes maxi)"]
[null,null,"x",{"$f":"HLOOKUP(calculs!B25,calculs!$B$1:$K$25,3,TRUE)","v":2},{"$f":"HLOOKUP(calculs!C25,calculs!$B$1:$K$25,3,TRUE)","v":5},{"$f":"HLOOKUP(calculs!D25,calculs!$B$1:$K$25,3,TRUE)","v":10},{"$f":"HLOOKUP(calculs!E25,calculs!$B$1:$K$25,3,TRUE)","v":7},{"$f":"HLOOKUP(calculs!F25,calculs!$B$1:$K$25,3,TRUE)","v":8},{"$f":"HLOOKUP(calculs!G25,calculs!$B$1:$K$25,3,TRUE)","v":6},{"$f":"HLOOKUP(calculs!H25,calculs!$B$1:$K$25,3,TRUE)","v":9},"x",null,null,null,"x",{"$f":"HLOOKUP(calculs!B1,calculs!$B$1:$K$3,3,TRUE)","v":2},{"$f":"HLOOKUP(calculs!C1,calculs!$B$1:$K$3,3,TRUE)","v":5},{"$f":"HLOOKUP(calculs!D1,calculs!$B$1:$K$3,3,TRUE)","v":10},{"$f":"HLOOKUP(calculs!E1,calculs!$B$1:$K$3,3,TRUE)","v":7},{"$f":"HLOOKUP(calculs!F1,calculs!$B$1:$K$3,3,TRUE)","v":8},{"$f":"HLOOKUP(calculs!G1,calculs!$B$1:$K$3,3,TRUE)","v":6},{"$f":"HLOOKUP(calculs!H1,calculs!$B$1:$K$3,3,TRUE)","v":9},"x"]
[null,null,{"$f":"HLOOKUP(calculs!B28,calculs!$B$28:$K$30,3,TRUE)","v":1},null,null,null,null,null,null,null,{"$f":"C7","v":1},null,null,null,{"$f":"HLOOKUP(calculs!B4,calculs!B4:K6,3,TRUE)","v":4},null,null,null,null,null,null,null,{"$f":"O7","v":4}]
[null,null,{"$f":"HLOOKUP(calculs!C28,calculs!$B$28:$K$30,3,TRUE)","v":8},null,null,null,null,null,null,null,{"$f":"C8","v":8},null,null,null,{"$f":"HLOOKUP(calculs!C4,calculs!B4:K6,3,TRUE)","v":8},null,null,null,null,null,null,null,{"$f":"O8","v":8}]
[null,null,{"$f":"HLOOKUP(calculs!D28,calculs!$B$28:$K$30,3,TRUE)","v":9},null,null,null,null,null,null,null,9,null,null,null,{"$f":"HLOOKUP(calculs!D4,calculs!B4:K6,3,TRUE)","v":5},null,null,null,null,null,null,null,5]
[null,null,{"$f":"HLOOKUP(calculs!E28,calculs!$B$28:$K$30,3,TRUE)","v":6},null,null,null,null,null,null,null,6,null,null,null,{"$f":"HLOOKUP(calculs!E4,calculs!B4:K6,3,TRUE)","v":10},null,null,null,null,null,null,null,10]
{"$rows_left_out":27}
{"sheet":"Pythagores (100)","index":10,"n_rows":43,"n_cols":29,"rows_kept":43,"cut":false,"hidden":false,"merged":[[2,3,2,12],[2,18,2,27],[16,3,16,12],[16,18,16,27],[30,3,30,12],[30,18,30,27],[42,1,42,14],[42,16,42,29],[28,16,28,29],[28,1,28,14],[14,1,14,14],[14,16,14,29]]}
[null,null,null,null,"Pour générer de nouvelles tables, appuyez sur F9"]
[]
[null,null,null,"100 cases (7 minutes maxi)",null,null,null,null,null,null,null,null,null,null,null,null,null,null,"100 cases (7 minutes maxi)"]
[null,null,"x",{"$f":"HLOOKUP(calculs!B28,calculs!$B$28:$K$31,3,TRUE)","v":1},{"$f":"HLOOKUP(calculs!C28,calculs!$B$28:$K$31,3,TRUE)","v":8},{"$f":"HLOOKUP(calculs!D28,calculs!$B$28:$K$31,3,TRUE)","v":9},{"$f":"HLOOKUP(calculs!E28,calculs!$B$28:$K$31,3,TRUE)","v":6},{"$f":"HLOOKUP(calculs!F28,calculs!$B$28:$K$31,3,TRUE)","v":4},{"$f":"HLOOKUP(calculs!G28,calculs!$B$28:$K$31,3,TRUE)","v":3},{"$f":"HLOOKUP(calculs!H28,calculs!$B$28:$K$31,3,TRUE)","v":10},{"$f":"HLOOKUP(calculs!I28,calculs!$B$28:$K$31,3,TRUE)","v":7},{"$f":"HLOOKUP(calculs!J28,calculs!$B$28:$K$31,3,TRUE)","v":5},{"$f":"HLOOKUP(calculs!K28,calculs!$B$28:$K$31,3,TRUE)","v":2},"x",null,null,null,"x",{"$f":"HLOOKUP(calculs!B1,calculs!$B$1:$K$3,3,TRUE)","v":2},{"$f":"HLOOKUP(calculs!C1,calculs!$B$1:$K$3,3,TRUE)","v":5},{"$f":"HLOOKUP(calculs!D1,calculs!$B$1:$K$3,3,TRUE)","v":10},{"$f":"HLOOKUP(calculs!E1,calculs!$B$1:$K$3,3,TRUE)","v":7},{"$f":"HLOOKUP(calculs!F1,calculs!$B$1:$K$3,3,TRUE)","v":8},{"$f":"HLOOKUP(calculs!G1,calculs!$B$1:$K$3,3,TRUE)","v":6},{"$f":"HLOOKUP(calculs!H1,calculs!$B$1:$K$3,3,TRUE)","v":9},{"$f":"HLOOKUP(calculs!I1,calculs!$B$1:$K$3,3,TRUE)","v":3},{"$f":"HLOOKUP(calculs!J1,calculs!$B$1:$K$3,3,TRUE)","v":1},{"$f":"HLOOKUP(calculs!K1,calculs!$B$1:$K$3,3,TRUE)","v":4},"x"]
[null,null,{"$f":"HLOOKUP(calculs!B16,calculs!$B$16:$K$18,3,TRUE)","v":1},null,null,null,null,null,null,null,null,null,null,{"$f":"C5","v":1},null,null,null,{"$f":"HLOOKUP(calculs!B4,calculs!B4:K6,3,TRUE)","v":4},null,null,null,null,null,null,null,null,null,null,{"$f":"R5","v":4}]
[null,null,{"$f":"HLOOKUP(calculs!C16,calculs!$B$16:$K$18,3,TRUE)","v":4},null,null,null,null,null,null,null,null,null,null,{"$f":"C6","v":4},null,null,null,{"$f":"HLOOKUP(calculs!C4,calculs!B4:K6,3,TRUE)","v":8},null,null,null,null,null,null,null,null,null,null,{"$f":"R6","v":8}]
[null,null,{"$f":"HLOOKUP(calculs!D16,calculs!$B$16:$K$18,3,TRUE)","v":9},null,null,null,null,null,null,null,null,null,null,9,null,null,null,{"$f":"HLOOKUP(calculs!D4,calculs!B4:K6,3,TRUE)","v":5},null,null,null,null,null,null,null,null,null,null,5]
[null,null,{"$f":"HLOOKUP(calculs!E16,calculs!$B$16:$K$18,3,TRUE)","v":5},null,null,null,null,null,null,null,null,null,null,5,null,null,null,{"$f":"HLOOKUP(calculs!E4,calculs!B4:K6,3,TRUE)","v":10},null,null,null,null,null,null,null,null,null,null,10]
[null,null,{"$f":"HLOOKUP(calculs!F16,calculs!$B$16:$K$18,3,TRUE)","v":7},null,null,null,null,null,null,null,null,null,null,7,null,null,null,{"$f":"HLOOKUP(calculs!F4,calculs!B4:K6,3,TRUE)","v":7},null,null,null,null,null,null,null,null,null,null,7]
[null,null,{"$f":"HLOOKUP(calculs!G16,calculs!$B$16:$K$18,3,TRUE)","v":10},null,null,null,null,null,null,null,null,null,null,10,null,null,null,{"$f":"HLOOKUP(calculs!G4,calculs!B4:K6,3,TRUE)","v":1},null,null,null,null,null,null,null,null,null,null,1]
{"$rows_left_out":34}
{"sheet":"calculs","index":11,"n_rows":136,"n_cols":43,"rows_kept":136,"cut":false,"hidden":true,"merged":[[127,0,129,0],[130,0,132,0],[133,0,135,0],[112,0,114,0],[115,0,117,0],[118,0,120,0],[121,0,123,0],[124,0,126,0],[91,0,93,0],[94,0,96,0],[97,0,99,0],[106,0,108,0],[109,0,111,0],[76,0,78,0],[79,0,81,0],[82,0,84,0],[85,0,87,0],[88,0,90,0],[15,0,17,0],[36,0,38,0],[39,0,41,0],[42,0,44,0],[45,0,47,0],[0,0,2,0],[3,0,5,0],[6,0,8,0],[9,0,11,0],[12,0,14,0],[75,8,75,10],[75,11,75,13],[75,14,75,16],[75,17,75,19],[18,0,20,0],[21,0,23,0],[24,0,26,0],[27,0,29,0],[48,0,50,0],[51,0,53,0],[54,0,56,0],[57,0,59,0],[60,0,62,0],[63,0,65,0],[70,0,72,0],[73,0,75,0],[75,35,75,37],[75,20,75,22],[75,23,75,25],[75,26,75,28],[75,29,75,31],[75,32,75,34]]}
[1,1,2,3,4,5,6,7,8,9,10,null,null,"choix"]
[null,{"$f":"RAND()","v":0.93460519522004359},{"$f":"RAND()","v":0.46549644350014807},0.1494818025229111,0.31420873423794193,0.22304513060770215,0.34285567623936597,0.18472176275961505,0.89835225357756976,0.97454326482268583,0.61710194670746499,null,null,"oui"]
[null,{"$f":"RANK(B2,$B2:$K2)","v":2},{"$f":"RANK(C2,$B2:$K2)","v":5},10,7,8,6,9,3,1,4,null,null,"non"]
[2,1,2,3,4,5,6,7,8,9,10]
[null,{"$f":"RAND()","v":0.67005572050060191},{"$f":"RAND()","v":0.29386854305215337},0.49107357232888993,5.5010948295981077E-2,0.30977099489295545,0.95055077377199149,0.87839859282196242,0.93099761579991291,0.10586344725185282,0.40303978754766634]
[null,{"$f":"RANK(B5,$B5:$K5)","v":4},8,5,{"$f":"RANK(E5,$B5:$K5)","v":10},7,1,3,2,9,6]
[3,1,2,3,4,5,6,7,8,9,10]
[null,{"$f":"RAND()","v":0.39036208943681294},{"$f":"RAND()","v":0.61272715302714709},0.71275348368472879,0.36861398189116301,5.1616444025127994E-2,0.70535123670996636,0.43704024610557179,0.94583737296203496,0.76647384229573645,0.89044550979998671]
[null,{"$f":"RANK(B8,$B8:$K8)","v":8},6,4,9,10,5,7,1,3,2]
[4,1,2,3,4,5,6,7,8,9,10]
{"$rows_left_out":127}
{"sheet":"Graphique tables CE","index":12,"n_rows":59,"n_cols":46,"rows_kept":59,"cut":false,"hidden":false,"merged":[[55,0,55,1],[39,1,44,1],[39,0,44,0],[33,0,38,0],[27,0,32,0],[27,1,32,1],[33,1,38,1],[45,1,50,1],[45,0,50,0],[54,3,54,4],[54,6,54,7],[1,0,1,35],[2,3,2,7],[21,0,26,0],[21,1,26,1],[15,0,20,0],[15,1,20,1],[9,0,14,0],[3,0,8,0],[3,1,8,1],[2,0,2,2],[56,0,56,1],[55,3,55,4],[55,6,55,7],[9,1,14,1],[3,2,50,2],[56,3,56,6],[51,0,51,1],[52,0,52,1],[53,0,53,1],[54,0,54,1],[51,6,51,7],[52,6,52,7],[51,3,51,4],[52,3,52,4],[53,3,53,4],[53,6,53,7]]}
[]
["Brevets de tables de multiplication CE",null,null,null,null,null,null,null,null,null,null,null,null,null,null,null,null,null,null,null,null,null,null,null,null,null,null,null,null,null,null,null,null,null,null,null,null,null,null,null,null,null,null,"vitesse\n/case"]
["Or",null,null,"Moins de 3 minutes",null,null,null,null,null,null,null,null,null,null,null,null,null,null,null,null,null,null,null,null,null,null,null,null,null,null,null,null,null,null,null,null,null,null,null,null,null,null,null,{"$f":"(E4-0.001)/100","v":"00:01:47.736"}]
["Maxi argent","moins de 3 min. 30","100 cases","de","03:01:00","à","03:05:00",null,null,null,null,null,null,null,null,null,null,null,null,null,null,null,null,null,null,null,null,null,null,null,null,null,null,null,null,null,null,null,null,null,null,null,null,{"$f":"E4/100","v":"00:01:48.600"}]
[null,null,null,"de","03:06:00","à","03:10:00",null,null,null,null,null,null,null,null,null,null,null,null,null,null,null,null,null,null,null,null,null,null,null,null,null,null,null,null,null,null,null,null,null,null,null,null,{"$f":"E5/100","v":"00:01:51.600"}]
[null,null,null,"de","03:11:00","à","03:15:00",null,null,null,null,null,null,null,null,null,null,null,null,null,null,null,null,null,null,null,null,null,null,null,null,null,null,null,null,null,null,null,null,null,null,null,null,"00:01:54.600"]
[null,null,null,"de","03:16:00","à","03:20:00",null,null,null,null,null,null,null,null,null,null,null,null,null,null,null,null,null,null,null,null,null,null,null,null,null,null,null,null,null,null,null,null,null,null,null,null,"00:01:57.600"]
[null,null,null,"de","03:21:00","à","03:25:00",null,null,null,null,null,null,null,null,null,null,null,null,null,null,null,null,null,null,null,null,null,null,null,null,null,null,null,null,null,null,null,null,null,null,null,null,"00:02:00.600"]
[null,null,null,"de","03:26:00","à","03:30:00",null,null,null,null,null,null,null,null,null,null,null,null,null,null,null,null,null,null,null,null,null,null,null,null,null,null,null,null,null,null,null,null,null,null,null,null,"00:02:03.600"]
["Argent","moins de 4 minutes",null,"de","03:31:00","à","03:35:00",null,null,null,null,null,null,null,null,null,null,null,null,null,null,null,null,null,null,null,null,null,null,null,null,null,null,null,null,null,null,null,null,null,null,null,null,"00:02:06.600"]
{"$rows_left_out":50}
{"sheet":"Graphique tables CM","index":13,"n_rows":79,"n_cols":53,"rows_kept":79,"cut":false,"hidden":false,"merged":[[13,1,16,2],[10,1,12,2],[7,1,9,2],[39,1,44,2],[33,1,38,2],[27,1,32,2],[21,1,26,2],[17,1,20,2],[1,0,1,51],[78,0,79,51],[77,3,77,6],[71,1,72,2],[77,0,77,2],[2,3,2,6],[2,0,76,0],[75,1,76,2],[73,1,74,2],[69,1,70,2],[5,1,6,2],[2,1,4,2],[63,1,68,2],[57,1,62,2],[51,1,56,2],[45,1,50,2]]}
[]
["Brevets de tables de multiplication CM",null,null,null,null,null,null,null,null,null,null,null,null,null,null,null,null,null,null,null,null,null,null,null,null,null,null,null,null,null,null,null,null,null,null,null,null,null,null,null,null,null,null,null,null,null,null,null,null,null,null,null,"vitesse moyenne \npar case"]
["Grille 100 cases dans le désordre","Diamant",null,"Moins de 1' 30''",null,null,null,null,null,null,null,null,null,null,null,null,null,null,null,null,null,null,null,null,null,null,null,null,null,null,null,null,null,null,null,null,null,null,null,null,null,null,null,null,null,null,null,null,null,null,null,null,"0,94 sec/case"]
[null,null,null,"de","01:31:00","à","01:35:00",{"$f":"E4/100","v":"00:00:54.600"},null,null,null,null,null,null,null,null,null,null,null,null,null,null,null,null,null,null,null,null,null,null,null,null,null,null,null,null,null,null,null,null,null,null,null,null,null,null,null,null,null,null,null,null,"0,97 sec/case"]
[null,null,null,"de","01:36:00","à","01:40:00",{"$f":"E5/100","v":"00:00:57.600"},null,null,null,null,null,null,null,null,null,null,null,null,null,null,null,null,null,null,null,null,null,null,null,null,null,null,null,null,null,null,null,null,null,null,null,null,null,null,null,null,null,null,null,null,{"$f":"G5/100","v":"00:01:00"}]
[null,"Rubis",null,"de","01:41:00","à","01:45:00","00:01:00.600",null,null,null,null,null,null,null,null,null,null,null,null,null,null,null,null,null,null,null,null,null,null,null,null,null,null,null,null,null,null,null,null,null,null,null,null,null,null,null,null,null,null,null,null,"00:01:03"]
[null,null,null,"de","01:46:00","à","01:50:00","00:01:03.600",null,null,null,null,null,null,null,null,null,null,null,null,null,null,null,null,null,null,null,null,null,null,null,null,null,null,null,null,null,null,null,null,null,null,null,null,null,null,null,null,null,null,null,null,"00:01:06"]
[null,"Emeraude",null,"de","01:51:00","à","01:55:00","00:01:06.600",null,null,null,null,null,null,null,null,null,null,null,null,null,null,null,null,null,null,null,null,null,null,null,null,null,null,null,null,null,null,null,null,null,null,null,null,null,null,null,null,null,null,null,null,"00:01:09"]
[null,null,null,"de","01:56:00","à","02:00:00","00:01:09.600",null,null,null,null,null,null,null,null,null,null,null,null,null,null,null,null,null,null,null,null,null,null,null,null,null,null,null,null,null,null,null,null,null,null,null,null,null,null,null,null,null,null,null,null,"00:01:12"]
[null,null,null,"de","02:01:00","à","02:05:00","00:01:12.600",null,null,null,null,null,null,null,null,null,null,null,null,null,null,null,null,null,null,null,null,null,null,null,null,null,null,null,null,null,null,null,null,null,null,null,null,null,null,null,null,null,null,null,null,"00:01:15"]
{"$rows_left_out":69}